{"text_format":"1","workbook":"xlsx","n_sheets":3,"sheets":["Форма","Справочные данные","2021"],"not_rendered":{"charts":0,"images":0,"macros":1,"external_links":0,"defined_names":4,"comments":0,"pivot_tables":0},"unopened":[],"bounds":{"document_bytes":16777216,"sheet_cells":100000,"rows_first":2000,"rows_last":500,"rows_between":2000,"halvings":0,"cell_chars":16384,"cell_head_chars":4096},"cells_cut":0,"cells_raw":0,"read":"whole","date_system":"1900"}

{"sheet":"Форма","index":0,"n_rows":39,"n_cols":38,"rows_kept":39,"cut":false,"hidden":false,"merged":[[30,10,31,10],[30,11,31,12],[32,11,32,12],[36,11,36,12],[37,11,37,12],[0,0,0,11],[7,2,7,9],[22,4,22,6],[24,2,24,6],[9,1,11,11],[2,6,2,11],[3,6,3,11],[4,6,4,11],[5,6,5,11]]}
["Протокол не может быть воспроизведен полностью или частично без письменного разрешения испытательной лаборатории",null,null,null,null,null,null,null,null,null,null,null,null,null,null,null,null,null,null,null,null,null,null,null,null,null,null,null,null,null,null,null,null,null,null,null,null,1]
[]
[null,null,null,null,null,null,"Лаборатория"]
[null,null,null,null,null,null,"адрес"]
[" ",null,null,null,null,null,{"$f":"L37","v":0}]
[null,null,null,null,null,null,{"$f":"L38","v":0}]
[]
[null,null,{"$f":"\"Выписка №\"&B31&\" от \"&TEXT(D31,\"дд.ММ.гг\")&\" г.\"","v":"Выписка №1а-2021 от 28.09.20 г."}]
[]
["Объект:",{"$f":"L31","v":"Строительство и реконструкция автомобильной дороги М-7 \"Волга\" от Москвы через Владимир, Нижний Новгород, Казань до Уфы. Реконструкция мостового перехода через реку Свияга на км 757 автомобильной дороги М-7 \"Волга\" Москва - Владимир - Нижний Новгород - Казань - Уфа, Республика Татарстан."}]
[]
[]
["Заказчик:",{"$f":"L33","v":0}]
[{"$f":"J31","v":0}]
[{"$f":"J32","v":0}]
[0]
[0]
["Условия испытания:",null,"Температура воздуха (оС)",null,{"$f":"D32","v":15},"Относительная влажность (%)",null,null,{"$f":"D33","v":56}]
["Номер образца","Сертификат","Плавка","Дата испытаний","Марка стали","Диаметр арматуры, мм","Площадь, мм2","Нагрузка при пределе текучести, кН","Разрывное усилие, кН","Предел текучести, МПа","Временное сопротивление, МПа","Относительное удлинение, %"]
[1,{"$f":"B32","v":0},{"$f":"B35","v":0},{"$f":"D31","v":"2020-09-28"},{"$f":"B36","v":"25Г2С"},{"$f":"B38","v":20},{"$f":"D35","v":{"$error":"#N/A"}},{"$f":"F31","v":103.1},{"$f":"F32","v":153.69999999999999},{"$f":"H31","v":{"$error":"#N/A"}},{"$f":"H32","v":{"$error":"#N/A"}},{"$f":"H33","v":{"$error":"#N/A"}}]
[2,{"$f":"IF(B33=\"\",B32,B33)","v":0},{"$f":"B35","v":0},{"$f":"D31","v":"2020-09-28"},{"$f":"B36","v":"25Г2С"},{"$f":"B38","v":20},{"$f":"D35","v":{"$error":"#N/A"}},{"$f":"F34","v":101.2},{"$f":"F35","v":152.30000000000001},{"$f":"H34","v":{"$error":"#N/A"}},{"$f":"H35","v":{"$error":"#N/A"}},{"$f":"H36","v":{"$error":"#N/A"}}]
[3,{"$f":"IF( AND(B34=\"\",B33=\"\"),B32,IF(B34=\"\",B33,B34))","v":0},{"$f":"B35","v":0},{"$f":"D31","v":"2020-09-28"},{"$f":"B36","v":"25Г2С"},{"$f":"B38","v":20},{"$f":"D35","v":{"$error":"#N/A"}},{"$f":"F37","v":101.4},{"$f":"F38","v":152},{"$f":"H37","v":{"$error":"#N/A"}},{"$f":"H38","v":{"$error":"#N/A"}},{"$f":"H39","v":{"$error":"#N/A"}}]
["ЗАКЛЮЧЕНИЕ: Испытанная арматурная сталь",null,null,null,{"$f":"J37","v":"соответствует"},null,null,{"$f":"\" требованиям \"&B39&\".\"","v":" требованиям ГОСТ 5781-82."}]
[]
["Партия арматурной стали",null,{"$f":"IF(E23=\"соответствует\",\"подлежит приемке\", \"не подлежит приемке\")","v":"подлежит приемке"},null,null,null,null,null,null,null,null,null,null,"Вставлять \"Значения\" в ячейку A31 из листа 2021"]
[]
["Испытал:",null,null,null,null,{"$f":"L35","v":0},null,null,{"$f":"M35","v":0}]
[]
[null,null,null,null,null,{"$f":"L36","v":0},null,null,{"$f":"M36","v":0}]
[]
["Номер выписки","1а-2021","Дата","2020-09-28","Пред.тек",103.1,"Пред.тек",{"$f":"ROUND(F31/D35*1000,1)","v":{"$error":"#N/A"}},"Разрывная машина",null,"Объект","Строительство и реконструкция автомобильной дороги М-7 \"Волга\" от Москвы через Владимир, Нижний Новгород, Казань до Уфы. Реконструкция мостового перехода через реку Свияга на км 757 автомобильной дороги М-7 \"Волга\" Москва - Владимир - Нижний Новгород - Казань - Уфа, Республика Татарстан.",null,null,"- можно изменять"]
["№ сертификата1",null,"Температура",15,"Вр.сопр 1",153.69999999999999,"Вр.сопр 1",{"$f":"ROUND(F32/D35*1000,1)","v":{"$error":"#N/A"}},"Термогигрометр",null,null,null,null,null,"- можно выбрать из перечня"]
["№ сертификата2",null,"Влажность",56,"Удлинение 1",138,"Удлинение 1",{"$f":"(F33-D34)/D34*100","v":{"$error":"#N/A"}},"Линейка",null,"Заказчик",null,null,null,"- не трогать. Формула"]
["№ сертификата3",null,"Нач.расч.длина",{"$f":"VLOOKUP(B38,'Справочные данные'!G31:H60,2,FALSE)","v":{"$error":"#N/A"}},"Пред.тек 2",101.2,"Пред.тек 2",{"$f":"ROUND(F34/D35*1000,1)","v":{"$error":"#N/A"}},"Весы",null,"Подписи","Должность","ФИО"]
["№ плавки",null,"Площадь",{"$f":"IF(B39=\"ГОСТ 5781-82\",VLOOKUP(B38,'Справочные данные'!A30:B51,2,FALSE),VLOOKUP(B38,'Справочные данные'!D30:E60,2,FALSE))","v":{"$error":"#N/A"}},"Вр.сопр 2",152.30000000000001,"Вр.сопр 2",{"$f":"ROUND(F35/D35*1000,1)","v":{"$error":"#N/A"}},null,null,"Испытал"]
["Марка стали","25Г2С",null,null,"Удлинение 2",135,"Удлинение 2",{"$f":"(F36-D34)/D34*100","v":{"$error":"#N/A"}}]
["Класс стали","AIII",null,null,"Пред.тек 3",101.4,"Пред.тек 3",{"$f":"ROUND(F37/D35*1000,1)","v":{"$error":"#N/A"}},"Заключение","соответствует","аттестат"]
["Диаметр",20,null,null,"Вр.сопр 3",152,"Вр.сопр 3",{"$f":"ROUND(F38/D35*1000,1)","v":{"$error":"#N/A"}},"Скан",null,"№"]
["ГОСТ","ГОСТ 5781-82",null,null,"Удлинение 3",136,"Удлинение 3",{"$f":"(F39-D34)/D34*100","v":{"$error":"#N/A"}}]

{"sheet":"Справочные данные","index":1,"n_rows":31,"n_cols":8,"rows_kept":31,"cut":false,"hidden":false,"merged":[[0,0,0,1],[0,3,0,4]]}
["ГОСТ 5781-82",null,null,"ГОСТ 34028-2016",null,null,"Нач.расч.длина"]
["Диаметр","Площадь",null,"Диаметр","Площадь",null,"Диаметр","Длина"]
[6,28.3,null,4,12.6,null,4,20]
[8,50.3,null,4.5,15.9,null,4.5,20]
[10,78.5,null,5,19.600000000000001,null,5,30]
[12,113.1,null,5.5,23.8,null,5.5,30]
[14,154,null,6,28.3,null,6,30]
[16,201,null,6.5,33.200000000000003,null,6.5,30]
[18,254,null,7,38.5,null,7,40]
[20,314,null,7.5,44.2,null,7.5,40]
[22,380,null,8,50.3,null,8,40]
[25,491,null,8.5,56.7,null,8.5,40]
[28,616,null,9,63.6,null,9,50]
[32,804,null,9.5,70.900000000000006,null,9.5,50]
[36,1018,null,10,75.5,null,10,50]
[40,1257,null,11,95,null,11,60]
[45,1500,null,12,113.1,null,12,60]
[50,1963,null,13,132.69999999999999,null,13,70]
[55,2376,null,14,153.9,null,14,70]
[60,2827,null,15,176.7,null,15,80]
[70,3848,null,16,201.1,null,16,80]
[80,5027,null,17,227,null,17,90]
[null,null,null,18,254.5,null,18,90]
[null,null,null,19,283.5,null,19,100]
[null,null,null,20,314.2,null,20,100]
[null,null,null,22,380.1,null,22,110]
[null,null,null,25,490.9,null,25,130]
[null,null,null,28,615.79999999999995,null,28,140]
[null,null,null,32,804.3,null,32,160]
[null,null,null,36,1017.9,null,36,180]
[null,null,null,40,1256.5999999999999,null,40,200]

{"sheet":"2021","index":2,"n_rows":10,"n_cols":15,"rows_kept":10,"cut":false,"hidden":false,"merged":[[1,10,2,10],[1,11,2,12],[3,11,3,12],[7,11,7,12],[8,11,8,12],[0,10,0,12],[0,0,0,1],[0,2,0,3],[0,4,0,5],[0,6,0,7],[0,8,0,9]]}
["Параметры арматурной стали",null,"Условия испытаний",null,"Результаты",null,"Обсчет",null,"Оборудование",null,"Дополнительные данные",null,null,"Макрос для переноса Ctrl+т (русская)"]
["Номер выписки","1а-2021","Дата","2020-09-28","Пред.тек",103.1,"Пред.тек",{"$f":"ROUND(F2/D6*1000,1)","v":328.3},"Разрывная машина",null,"Объект","Строительство и реконструкция автомобильной дороги М-7 \"Волга\" от Москвы через Владимир, Нижний Новгород, Казань до Уфы. Реконструкция мостового перехода через реку Свияга на км 757 автомобильной дороги М-7 \"Волга\" Москва - Владимир - Нижний Новгород - Казань - Уфа, Республика Татарстан.",null,null,"- можно изменять"]
["№ сертификата1",null,"Температура",15,"Вр.сопр 1",153.69999999999999,"Вр.сопр 1",{"$f":"ROUND(F3/D6*1000,1)","v":489.5},"Термогигрометр",null,null,null,null,null,"- можно выбрать из перечня"]
["№ сертификата2",null,"Влажность",56,"Удлинение 1",138,"Удлинение 1",{"$f":"(F4-D5)/D5*100","v":38},"Линейка",null,"Заказчик",null,null,null,"- не трогать. Формула"]
["№ сертификата3",null,"Нач.расч.длина",{"$f":"VLOOKUP(B9,'Справочные данные'!G2:H31,2,FALSE)","v":100},"Пред.тек 2",101.2,"Пред.тек 2",{"$f":"ROUND(F5/D6*1000,1)","v":322.3},"Весы",null,"Подписи","Должность","ФИО"]
["№ плавки",null,"Площадь",{"$f":"IF(B10=\"ГОСТ 5781-82\",VLOOKUP(B9,'Справочные данные'!A1:B22,2,FALSE),VLOOKUP(B9,'Справочные данные'!D1:E31,2,FALSE))","v":314},"Вр.сопр 2",152.30000000000001,"Вр.сопр 2",{"$f":"ROUND(F6/D6*1000,1)","v":485},null,null,"Испытал"]
["Марка стали","25Г2С",null,null,"Удлинение 2",135,"Удлинение 2",{"$f":"(F7-D5)/D5*100","v":35}]
["Класс стали","AIII",null,null,"Пред.тек 3",101.4,"Пред.тек 3",{"$f":"ROUND(F8/D6*1000,1)","v":322.89999999999998},"Заключение","соответствует","аттестат"]
["Диаметр",20,null,null,"Вр.сопр 3",152,"Вр.сопр 3",{"$f":"ROUND(F9/D6*1000,1)","v":484.1},"Скан",null,"№"]
["ГОСТ","ГОСТ 5781-82",null,null,"Удлинение 3",136,"Удлинение 3",{"$f":"(F10-D5)/D5*100","v":36}]